Dagrecreatie, met inbegrip van sport
type: Concept
definition: Vorm van recreatie die niet langer duurt dan een dag, en waarbij dus geen sprake is van overnachting
in scheme: Hoofdfunctie stedenbouw
notation: Dagrecreatie, met inbegrip van sport
note: Vorm van recreatie die niet langer duurt dan een dag, en waarbij dus geen sprake is van overnachting
top concept of: Hoofdfunctie stedenbouw

Dancing, restaurant en café
type: Concept
definition: Bedrijfstak die zich bezighoudt met eten, drinken en dansgelegenheden. Horeca, maar dan zonder de logies.
in scheme: Hoofdfunctie stedenbouw
notation: Dancing, restaurant en café
note: Bedrijfstak die zich bezighoudt met eten, drinken en dansgelegenheden. Horeca, maar dan zonder de logies.
top concept of: Hoofdfunctie stedenbouw

Detailhandel
type: Concept
definition: Bedrijfstak die zich bezighoudt met de verkoop van fysieke goederen aan consumenten
in scheme: Hoofdfunctie stedenbouw
notation: Detailhandel
note: Bedrijfstak die zich bezighoudt met de verkoop van fysieke goederen aan consumenten
top concept of: Hoofdfunctie stedenbouw
theme: http://www.eionet.europa.eu/gemet/concept/7193

Gemeenschapsvoorzieningen en openbare nutsvoorzieningen
type: Concept
definition: Voorzieningen die gericht zijn op de bevordering van het algemeen belang en die ten dienste van de gemeenschap worden gesteld (Bron: 8 JULI 1997. Omzendbrief betreffende de inrichting en de toepassing van de ontwerp-gewestplannen en gewestplannen, gewijzigd via omzendbrief dd. 25/1/2002 en 25/10/2002)
in scheme: Hoofdfunctie stedenbouw
notation: Gemeenschapsvoorzieningen en openbare nutsvoorzieningen
note: Voorzieningen die gericht zijn op de bevordering van het algemeen belang en die ten dienste van de gemeenschap worden gesteld (Bron: 8 JULI 1997. Omzendbrief betreffende de inrichting en de toepassing van de ontwerp-gewestplannen en gewestplannen, gewijzigd via omzendbrief dd. 25/1/2002 en 25/10/2002)
top concept of: Hoofdfunctie stedenbouw

Industrie en bedrijvigheid
type: Concept
definition: Bedrijfstak die zich bezighoudt met de verwerking van grondstoffen tot (half)producten
in scheme: Hoofdfunctie stedenbouw
notation: Industrie en bedrijvigheid
note: Bedrijfstak die zich bezighoudt met de verwerking van grondstoffen tot (half)producten
top concept of: Hoofdfunctie stedenbouw
theme: http://www.eionet.europa.eu/gemet/concept/19

Kantoorfunctie, dienstverlening en vrije beroepen
type: Concept
definition: Bedrijfstak die zich bezighoudt met het verlenen van diensten, inclusief administratieve werkzaamheden en intellectuele diensten.
in scheme: Hoofdfunctie stedenbouw
notation: Kantoorfunctie, dienstverlening en vrije beroepen
note: Bedrijfstak die zich bezighoudt met het verlenen van diensten, inclusief administratieve werkzaamheden en intellectuele diensten.
top concept of: Hoofdfunctie stedenbouw

Land- en tuinbouw in de ruime zin
type: Concept
definition: Bedrijfstak die zich bezighoudt met de productie van paddestoelen, planten en dieren
in scheme: Hoofdfunctie stedenbouw
notation: Land- en tuinbouw in de ruime zin
note: Bedrijfstak die zich bezighoudt met de productie van paddestoelen, planten en dieren
top concept of: Hoofdfunctie stedenbouw
theme: http://www.eionet.europa.eu/gemet/concept/232

Militaire functie
type: Concept
definition: Werking ten behoeve van de krijgsmacht van de staat
in scheme: Hoofdfunctie stedenbouw
notation: Militaire functie
note: Werking ten behoeve van de krijgsmacht van de staat
top concept of: Hoofdfunctie stedenbouw

Verblijfsrecreatie
type: Concept
definition: Vorm van recreatie waarbij de recreant voor een bepaalde tijd, maar ten minste een nacht, in het recreatiegebied of de toeristische plaats verblijft
in scheme: Hoofdfunctie stedenbouw
notation: Verblijfsrecreatie
note: Vorm van recreatie waarbij de recreant voor een bepaalde tijd, maar ten minste een nacht, in het recreatiegebied of de toeristische plaats verblijft
top concept of: Hoofdfunctie stedenbouw

Wonen
type: Concept
definition: Huisvesting van een gezin of alleenstaande
in scheme: Hoofdfunctie stedenbouw
notation: Wonen
note: Huisvesting van een gezin of alleenstaande
top concept of: Hoofdfunctie stedenbouw

Hoofdfunctie stedenbouw
type: ConceptScheme
definition: De functies die in kader van een omgevingsvergunning voor stedenbouwkundige handelingen als hoofdfunctie beschouwd worden in Artikel 2, § 1, van het Besluit van de Vlaamse Regering van 14 april 2000 tot bepaling van de vergunningsplichtige functiewijzigingen
has top concept: Dagrecreatie, met inbegrip van sport
has top concept: Dancing, restaurant en café
has top concept: Detailhandel
has top concept: Gemeenschapsvoorzieningen en openbare nutsvoorzieningen
has top concept: Industrie en bedrijvigheid
has top concept: Kantoorfunctie, dienstverlening en vrije beroepen
has top concept: Land- en tuinbouw in de ruime zin
has top concept: Militaire functie
has top concept: Verblijfsrecreatie
has top concept: Wonen
notation: Hoofdfunctie stedenbouw
note: De functies die in kader van een omgevingsvergunning voor stedenbouwkundige handelingen als hoofdfunctie beschouwd worden in Artikel 2, § 1, van het Besluit van de Vlaamse Regering van 14 april 2000 tot bepaling van de vergunningsplichtige functiewijzigingen