Collectie van concepten die gebruikt worden binnen de applicatie verwaarlozing en leegstand.
type: Collection
definition: het vertonen van uitgesproken gebreken van algemene of beperkte omvang aan het bedrijfsgebouw. De Vlaamse regering bepaalt de gebreken van algemene en beperkte omvang, alsook de criteria voor de beoordeling van de gebreken en de minimumnorm van de te vertonen gebreken om een bedrijfsruimte al dan niet als geheel of gedeeltelijk verwaarloosd te beschouwen;
in scheme: Codelijst bouw
member: Schoorsteen
member: Buitenmuur
member: Buitentimmerwerk
member: Dakbedekking
member: Dakgebinte
member: Dakgoot
member: Kroonlijst
member: Lift
member: Stabiliteit
member: Trap
member: Veiligheid
member: Vochtindringing
notation: CO_VERWAARLOZING
note: het vertonen van uitgesproken gebreken van algemene of beperkte omvang aan het bedrijfsgebouw. De Vlaamse regering bepaalt de gebreken van algemene en beperkte omvang, alsook de criteria voor de beoordeling van de gebreken en de minimumnorm van de te vertonen gebreken om een bedrijfsruimte al dan niet als geheel of gedeeltelijk verwaarloosd te beschouwen;
theme: http://www.eionet.europa.eu/gemet/theme/5

Schoorsteen
type: Concept
broader: Gebouwonderdeel
broader transitive: Gebouw
broader transitive: Gebouwonderdeel
definition: Een verticale structuur van baksteen, metselwerk of staal die rook of stoom wegvoert van een brand, motor, enz.
in scheme: Codelijst bouw
mapping relation: http://www.eionet.europa.eu/gemet/concept/1355
notation: SCHOORSTEEN
note: Een verticale structuur van baksteen, metselwerk of staal die rook of stoom wegvoert van een brand, motor, enz.
semantic relation: Gebouw
semantic relation: Gebouwonderdeel
semantic relation: http://www.eionet.europa.eu/gemet/concept/1355
theme: http://www.eionet.europa.eu/gemet/theme/5

Buitenmuur
type: Concept
broader: Muur
broader transitive: Gebouw
broader transitive: Gebouwonderdeel
broader transitive: Muur
definition: Een buitenmuur is de muur aan de buitenkant van een gebouw. Het is het van buitenaf zichtbare deel van de muur en heeft als voornaamste functie bescherming tegen de elementen, zoals regen, wind en zon. De buitenmuur kan gemaakt zijn van baksteen, beton, natuursteen of metaal
in scheme: Codelijst bouw
notation: BUITENMUUR
note: Een buitenmuur is de muur aan de buitenkant van een gebouw. Het is het van buitenaf zichtbare deel van de muur en heeft als voornaamste functie bescherming tegen de elementen, zoals regen, wind en zon. De buitenmuur kan gemaakt zijn van baksteen, beton, natuursteen of metaal
semantic relation: Gebouw
semantic relation: Gebouwonderdeel
semantic relation: Muur
theme: http://www.eionet.europa.eu/gemet/theme/5

Buitentimmerwerk
type: Concept
broader: Gebouwonderdeel
broader transitive: Gebouw
broader transitive: Gebouwonderdeel
definition: Al het timmerwerk dat plaats vindt aan de buitenkant van de woning.
in scheme: Codelijst bouw
notation: BUITENTIMMERWERK
note: Al het timmerwerk dat plaats vindt aan de buitenkant van de woning.
semantic relation: Gebouw
semantic relation: Gebouwonderdeel
theme: http://www.eionet.europa.eu/gemet/theme/5

Dakbedekking
type: Concept
broader: Dak
broader transitive: Gebouw
broader transitive: Gebouwonderdeel
broader transitive: Dak
definition: Dakbedekking of dakbekleding is een beschermende laag die op een plat of hellend dak wordt aangebracht, om dit waterdicht, sneeuwdicht en tochtvrij te maken. Het materiaal moet onbrandbaar, weersbestendig en het liefst licht van gewicht zijn.
in scheme: Codelijst bouw
notation: DAKBEDEKKING
note: Dakbedekking of dakbekleding is een beschermende laag die op een plat of hellend dak wordt aangebracht, om dit waterdicht, sneeuwdicht en tochtvrij te maken. Het materiaal moet onbrandbaar, weersbestendig en het liefst licht van gewicht zijn.
semantic relation: Gebouw
semantic relation: Gebouwonderdeel
semantic relation: Dak
theme: http://www.eionet.europa.eu/gemet/theme/5

Dakgebinte
type: Concept
broader: Dak
broader transitive: Gebouw
broader transitive: Gebouwonderdeel
broader transitive: Dak
definition: Een dakconstructie van verschillende homogene materialen (hout, metaal of beton) en is een van de hoofddelen van een gebouw die zorgt voor structurele stabiliteit.
in scheme: Codelijst bouw
notation: DAKGEBINTE
note: Een dakconstructie van verschillende homogene materialen (hout, metaal of beton) en is een van de hoofddelen van een gebouw die zorgt voor structurele stabiliteit.
semantic relation: Gebouw
semantic relation: Gebouwonderdeel
semantic relation: Dak
theme: http://www.eionet.europa.eu/gemet/theme/5

Dakgoot
type: Concept
broader: Dak
broader transitive: Gebouw
broader transitive: Gebouwonderdeel
broader transitive: Dak
definition: Een dakgoot of goot is een langgerekte bakvormige (bakgoot) of halfronde (mastgoot) constructie, die tot doel heeft, het van het dak komende regen- en smeltwater op te vangen en af te voeren
in scheme: Codelijst bouw
notation: DAKGOOT
note: Een dakgoot of goot is een langgerekte bakvormige (bakgoot) of halfronde (mastgoot) constructie, die tot doel heeft, het van het dak komende regen- en smeltwater op te vangen en af te voeren
semantic relation: Gebouw
semantic relation: Gebouwonderdeel
semantic relation: Dak
theme: http://www.eionet.europa.eu/gemet/theme/5

Kroonlijst
type: Concept
broader: Gebouwonderdeel
broader transitive: Gebouw
broader transitive: Gebouwonderdeel
definition: Een kroonlijst of deklijst is een horizontale band aan een bouwwerk, meestal uitspringend en geprofileerd of van versieringen voorzien. Ze verfraaien de verbinding tussen bijvoorbeeld wand en plafond
in scheme: Codelijst bouw
notation: KROONLIJST
note: Een kroonlijst of deklijst is een horizontale band aan een bouwwerk, meestal uitspringend en geprofileerd of van versieringen voorzien. Ze verfraaien de verbinding tussen bijvoorbeeld wand en plafond
semantic relation: Gebouw
semantic relation: Gebouwonderdeel
theme: http://www.eionet.europa.eu/gemet/theme/5

Lift
type: Concept
broader: Gebouwonderdeel
broader transitive: Gebouw
broader transitive: Gebouwonderdeel
definition: hijstoestel om voorwerpen of personen van de ene verdieping van een gebouw naar een andere te vervoeren
in scheme: Codelijst bouw
notation: LIFT
note: hijstoestel om voorwerpen of personen van de ene verdieping van een gebouw naar een andere te vervoeren
semantic relation: Gebouw
semantic relation: Gebouwonderdeel
theme: http://www.eionet.europa.eu/gemet/theme/5

Stabiliteit
type: Concept
broader: Algemene kenmerken
broader transitive: Gebouw
broader transitive: Algemene kenmerken
definition: De stabiliteit van een constructie heeft vooral betrekking op de weerstand tegen horizontale krachten waardoor constructie-onderdelen van elkaar los kunnen raken. Wanneer een gebouw niet voldoende stabiliteit heeft, kan het bezwijken onder de op het gebouw uitgevoerde belastingen (bijvoorbeeld windbelasting, eigen gewicht, trillingen, bevingen).
in scheme: Codelijst bouw
notation: STABILITEIT
note: De stabiliteit van een constructie heeft vooral betrekking op de weerstand tegen horizontale krachten waardoor constructie-onderdelen van elkaar los kunnen raken. Wanneer een gebouw niet voldoende stabiliteit heeft, kan het bezwijken onder de op het gebouw uitgevoerde belastingen (bijvoorbeeld windbelasting, eigen gewicht, trillingen, bevingen).
semantic relation: Gebouw
semantic relation: Algemene kenmerken
theme: http://www.eionet.europa.eu/gemet/theme/5

Trap
type: Concept
broader: Gebouwonderdeel
broader transitive: Gebouw
broader transitive: Gebouwonderdeel
definition: Een opeenvolging van treden of meerdere reeksen treden verbonden door middel van overlopen, bedoeld om van de ene verdieping naar de andere te komen
in scheme: Codelijst bouw
notation: TRAP
note: Een opeenvolging van treden of meerdere reeksen treden verbonden door middel van overlopen, bedoeld om van de ene verdieping naar de andere te komen
semantic relation: Gebouw
semantic relation: Gebouwonderdeel
theme: http://www.eionet.europa.eu/gemet/theme/5

Veiligheid
type: Concept
broader: Algemene kenmerken
broader transitive: Gebouw
broader transitive: Algemene kenmerken
definition: Constructieve veiligheid is een belangrijk onderdeel van een bouwwerk. De kwaliteit van een constructie bepaalt een gebouw of kunstwerk voldoende sterk en stabiel blijft bij intensief gebruik en bij extreme situaties.
in scheme: Codelijst bouw
notation: VEILIGHEID
note: Constructieve veiligheid is een belangrijk onderdeel van een bouwwerk. De kwaliteit van een constructie bepaalt een gebouw of kunstwerk voldoende sterk en stabiel blijft bij intensief gebruik en bij extreme situaties.
semantic relation: Gebouw
semantic relation: Algemene kenmerken
theme: http://www.eionet.europa.eu/gemet/theme/5

Vochtindringing
type: Concept
broader: Algemene kenmerken
broader transitive: Gebouw
broader transitive: Algemene kenmerken
definition: Vochtproblemen ontstaan door opstijgend vocht, condensatie of lekkages en leiden tot schimmel, geurhinder en structurele schade. Veelvoorkomende oorzaken zijn slechte ventilatie, poreuze muren of waterinfiltratie.
in scheme: Codelijst bouw
notation: VOCHTINDRINGING
note: Vochtproblemen ontstaan door opstijgend vocht, condensatie of lekkages en leiden tot schimmel, geurhinder en structurele schade. Veelvoorkomende oorzaken zijn slechte ventilatie, poreuze muren of waterinfiltratie.
semantic relation: Gebouw
semantic relation: Algemene kenmerken
theme: http://www.eionet.europa.eu/gemet/theme/5

Algemene kenmerken
type: Concept
broader: Gebouw
broader transitive: Gebouw
definition: Problemen met het gebouw/de gebouwen omwille van verwaarlozing. Deze hebben een globale impact op het gebouw.
in scheme: Codelijst bouw
narrower: Stabiliteit
narrower: Veiligheid
narrower: Vochtindringing
narrower transitive: Stabiliteit
narrower transitive: Veiligheid
narrower transitive: Vochtindringing
notation: ALGEMENE_KENMERKEN
note: Problemen met het gebouw/de gebouwen omwille van verwaarlozing. Deze hebben een globale impact op het gebouw.
semantic relation: Gebouw
semantic relation: Stabiliteit
semantic relation: Veiligheid
semantic relation: Vochtindringing

Dak
type: Concept
broader: Gebouwonderdeel
broader transitive: Gebouw
broader transitive: Gebouwonderdeel
definition: Bovenafsluiting van een gebouw.
in scheme: Codelijst bouw
narrower: Dakbedekking
narrower: Dakgebinte
narrower: Dakgoot
narrower transitive: Dakbedekking
narrower transitive: Dakgebinte
narrower transitive: Dakgoot
notation: DAK
note: Bovenafsluiting van een gebouw.
semantic relation: Gebouw
semantic relation: Gebouwonderdeel
semantic relation: Dakbedekking
semantic relation: Dakgebinte
semantic relation: Dakgoot
theme: http://www.eionet.europa.eu/gemet/theme/5

Gebouw
type: Concept
definition: Iets gebouwd met een dak en muren, zoals een huis of fabriek.
in scheme: Codelijst bouw
mapping relation: http://www.eionet.europa.eu/gemet/concept/1029
narrower: Gebouwonderdeel
narrower: Algemene kenmerken
narrower transitive: Gebouwonderdeel
narrower transitive: Schoorsteen
narrower transitive: Muur
narrower transitive: Buitenmuur
narrower transitive: Buitentimmerwerk
narrower transitive: Dakbedekking
narrower transitive: Dakgebinte
narrower transitive: Dakgoot
narrower transitive: Kroonlijst
narrower transitive: Lift
narrower transitive: Stabiliteit
narrower transitive: Trap
narrower transitive: Veiligheid
narrower transitive: Vochtindringing
narrower transitive: Algemene kenmerken
narrower transitive: Dak
notation: GEBOUW
note: Iets gebouwd met een dak en muren, zoals een huis of fabriek.
semantic relation: http://www.eionet.europa.eu/gemet/concept/1029
semantic relation: Gebouwonderdeel
semantic relation: Schoorsteen
semantic relation: Muur
semantic relation: Buitenmuur
semantic relation: Buitentimmerwerk
semantic relation: Dakbedekking
semantic relation: Dakgebinte
semantic relation: Dakgoot
semantic relation: Kroonlijst
semantic relation: Lift
semantic relation: Stabiliteit
semantic relation: Trap
semantic relation: Veiligheid
semantic relation: Vochtindringing
semantic relation: Algemene kenmerken
semantic relation: Dak
top concept of: Codelijst bouw
theme: http://www.eionet.europa.eu/gemet/theme/5

Gebouwonderdeel
type: Concept
broader: Gebouw
broader transitive: Gebouw
definition: Een bouwelement dat gebruik maakt van industriële producten die als onafhankelijk worden vervaardigd totdat ze kunnen worden verbonden met andere elementen.
in scheme: Codelijst bouw
mapping relation: http://www.eionet.europa.eu/gemet/concept/1033
narrower: Schoorsteen
narrower: Muur
narrower: Buitentimmerwerk
narrower: Kroonlijst
narrower: Lift
narrower: Trap
narrower: Dak
narrower transitive: Schoorsteen
narrower transitive: Muur
narrower transitive: Buitenmuur
narrower transitive: Buitentimmerwerk
narrower transitive: Dakbedekking
narrower transitive: Dakgebinte
narrower transitive: Dakgoot
narrower transitive: Kroonlijst
narrower transitive: Lift
narrower transitive: Trap
narrower transitive: Dak
notation: GEBOUWONDERDEEL
note: Een bouwelement dat gebruik maakt van industriële producten die als onafhankelijk worden vervaardigd totdat ze kunnen worden verbonden met andere elementen.
semantic relation: Gebouw
semantic relation: http://www.eionet.europa.eu/gemet/concept/1033
semantic relation: Schoorsteen
semantic relation: Muur
semantic relation: Buitenmuur
semantic relation: Buitentimmerwerk
semantic relation: Dakbedekking
semantic relation: Dakgebinte
semantic relation: Dakgoot
semantic relation: Kroonlijst
semantic relation: Lift
semantic relation: Trap
semantic relation: Dak

Muur
type: Concept
broader: Gebouwonderdeel
broader transitive: Gebouw
broader transitive: Gebouwonderdeel
definition: Een verticale constructie gemaakt van steen, baksteen, hout, enz., met een lengte en hoogte die veel groter zijn dan de dikte, die wordt gebruikt om te omsluiten, te verdelen of te ondersteunen.
in scheme: Codelijst bouw
mapping relation: http://www.eionet.europa.eu/gemet/concept/9023
narrower: Buitenmuur
narrower transitive: Buitenmuur
notation: MUUR
note: Een verticale constructie gemaakt van steen, baksteen, hout, enz., met een lengte en hoogte die veel groter zijn dan de dikte, die wordt gebruikt om te omsluiten, te verdelen of te ondersteunen.
semantic relation: Gebouw
semantic relation: Gebouwonderdeel
semantic relation: http://www.eionet.europa.eu/gemet/concept/9023
semantic relation: Buitenmuur
theme: http://www.eionet.europa.eu/gemet/theme/5

Codelijst bouw
type: ConceptScheme
belongs to: codelijst-gebouw
definition: Codelijst over concepten die verband houden met de bouwsector, constructies, gebouw en onderdelen van gebouwen.
has top concept: Gebouw
notation: CS_GEBOUW
note: Codelijst over concepten die verband houden met de bouwsector, constructies, gebouw en onderdelen van gebouwen.
theme: http://www.eionet.europa.eu/gemet/theme/5