Collectie van boormethodes
type: Collection
in scheme: Conceptschema boormethodes
member: avegaarboring
member: diagrafieboring
member: directe spoelboring
member: drogeboring
member: edelmanboring
member: geen boring
member: gestoken boring
member: graafmachine
member: grijperboring
member: grindboring
member: gutsboring
member: hamerboring
member: handboring
member: handlepelboring
member: handpulsboring
member: handsteekboring
member: kernboring
member: lansen
member: lepelboring
member: luchthevelboring
member: machinale boring
member: meerdere technieken
member: omgekeerde spoelboring
member: onbekend
member: pulsboring
member: ramguts
member: ramkernboring
member: riversideboring
member: rollerbit
member: slagboring
member: roto-sonische boring
member: spade
member: spiraalboring
member: spoelboring
member: trilboring
member: veenboring
member: vrijwitboring
member: zuigerboring
notation: collectie_boormethodes

avegaarboring
type: Concept
alternative label: volle avegaarboring, gewone avegaarboring, machinale spiraalboring
broader: drogeboring
broader transitive: drogeboring
broader transitive: machinale boring
definition: De volle of gewone avegaarboring wordt uitgevoerd met een machinaal aangedreven spiraalboor (schroef). De grond wordt los gefreesd door een schroef die ook instaat voor het transport van de grond naar het maaiveld.
in scheme: Conceptschema boormethodes
notation: avegaarboring
note: Beschrijving in CMA/1/A.1 - Type Boringen en uitvoeringsmethodes gehanteerd bij staalname (https://reflabos.vito.be/2018/CMA_1_A.1.pdf).
note: De volle of gewone avegaarboring wordt uitgevoerd met een machinaal aangedreven spiraalboor (schroef). De grond wordt los gefreesd door een schroef die ook instaat voor het transport van de grond naar het maaiveld.
semantic relation: drogeboring
semantic relation: machinale boring
top concept of: Conceptschema boormethodes

diagrafieboring
type: Concept
broader: machinale boring
broader transitive: machinale boring
definition: Destructieve boring waarbij tijdens het boren de boorparameters (zoals boorsnelheid) geregistreerd worden om zo heterogene variaties in de ondergrond vast te leggen.
in scheme: Conceptschema boormethodes
notation: diagrafieboring
note: Beschrijving Techniek Verticale boringen (https://smetgroup.be/wp-content/uploads/techniek_verticale_boringen.pdf).
note: Destructieve boring waarbij tijdens het boren de boorparameters (zoals boorsnelheid) geregistreerd worden om zo heterogene variaties in de ondergrond vast te leggen.
semantic relation: machinale boring
top concept of: Conceptschema boormethodes

directe spoelboring
type: Concept
alternative label: directe spoelboring, direct flush, straight flush, spuitboring
broader: spoelboring
broader transitive: spoelboring
definition: Bij een directe spoelboring verloopt de neerwaartse watertoevoer via de boorstangen en de bij de boring vrijkomende grond wordt omhoog getransporteerd via de ruimte tussen de boorstangen en de boorwand, de zogenaamde annulaire ruimte.
in scheme: Conceptschema boormethodes
notation: directespoelboring
note: Beschrijving: Boren voor de installatie van verticale bodemwarmtewisselaars (versie 3.1) - Smart Geotherm: (https://www.smartgeotherm.be/documents/2014/01/boren-voor-de-installatie-van-verticale-bodemwarmtewisselaars-bij-ondiepe-geothermie.pdf/). Boringen en exploitatie van grondwaterwinningsputten. Deel 1 Overzicht van de meest gebruikte boortechnieken (https://navigator.emis.vito.be/light?woId=76828&woLang=nl&woVersion=2024-04-07).
note: Bij een directe spoelboring verloopt de neerwaartse watertoevoer via de boorstangen en de bij de boring vrijkomende grond wordt omhoog getransporteerd via de ruimte tussen de boorstangen en de boorwand, de zogenaamde annulaire ruimte.
semantic relation: spoelboring
top concept of: Conceptschema boormethodes

drogeboring
type: Concept
broader: machinale boring
broader transitive: machinale boring
definition: Machinaal uitgevoerde boring uitgevoerd zonder het gebruik van spoelvloeistof.
in scheme: Conceptschema boormethodes
narrower: avegaarboring
narrower: lepelboring
narrower: slagboring
narrower: trilboring
narrower transitive: avegaarboring
narrower transitive: gestoken boring
narrower transitive: lepelboring
narrower transitive: ramguts
narrower transitive: ramkernboring
narrower transitive: slagboring
narrower transitive: roto-sonische boring
narrower transitive: trilboring
notation: drogeboring
note: Machinaal uitgevoerde boring uitgevoerd zonder het gebruik van spoelvloeistof.
semantic relation: avegaarboring
semantic relation: gestoken boring
semantic relation: lepelboring
semantic relation: machinale boring
semantic relation: ramguts
semantic relation: ramkernboring
semantic relation: slagboring
semantic relation: roto-sonische boring
semantic relation: trilboring
top concept of: Conceptschema boormethodes

edelmanboring
type: Concept
broader: handboring
broader transitive: handboring
definition: Handboring uitgevoerd met een edelmanboor voor geroerde staalname.
in scheme: Conceptschema boormethodes
notation: edelmanboring
note: Beschrijving in CMA/1/A.1 - Type Boringen en uitvoeringsmethodes gehanteerd bij staalname (https://reflabos.vito.be/2018/CMA_1_A.1.pdf).
note: Handboring uitgevoerd met een edelmanboor voor geroerde staalname.
semantic relation: handboring
top concept of: Conceptschema boormethodes

geen boring
type: Concept
definition: Deze boormethode wordt gebruikt om objecten te beschrijven die niet bemonsterd werden d.m.v. een boring. Het kan gaan om een voorput, profiel, een groeve of een ontsluiting.
in scheme: Conceptschema boormethodes
narrower: graafmachine
narrower: spade
narrower transitive: graafmachine
narrower transitive: spade
notation: geenboring
note: Deze boormethode wordt gebruikt om objecten te beschrijven die niet bemonsterd werden d.m.v. een boring. Het kan gaan om een voorput, profiel, een groeve of een ontsluiting.
semantic relation: graafmachine
semantic relation: spade
top concept of: Conceptschema boormethodes

gestoken boring
type: Concept
alternative label: steekboring
broader: slagboring
broader transitive: drogeboring
broader transitive: machinale boring
broader transitive: slagboring
definition: Boring uitgevoerd met een machinaal aangedreven steekboor voorzien van een staalnamebuis die in de grond wordt geslagen voor (semi) ongeroerde staalname.
in scheme: Conceptschema boormethodes
notation: gestokenboring
note: Beschrijving in CMA/1/A.1 - Type Boringen en uitvoeringsmethodes gehanteerd bij staalname (https://reflabos.vito.be/2018/CMA_1_A.1.pdf).
note: Boring uitgevoerd met een machinaal aangedreven steekboor voorzien van een staalnamebuis die in de grond wordt geslagen voor (semi) ongeroerde staalname.
semantic relation: drogeboring
semantic relation: machinale boring
semantic relation: slagboring
top concept of: Conceptschema boormethodes

graafmachine
type: Concept
broader: geen boring
broader transitive: geen boring
definition: Deze boormethode wordt gebruikt om objecten te beschrijven die bemonsterd werden d.m.v. een graafmachine.
in scheme: Conceptschema boormethodes
notation: graafmachine
note: Deze boormethode wordt gebruikt om objecten te beschrijven die bemonsterd werden d.m.v. een graafmachine.
semantic relation: geen boring
top concept of: Conceptschema boormethodes

grijperboring
type: Concept
broader: machinale boring
broader transitive: machinale boring
definition: Dit is een methode die meestal wordt aangewend voor het aanleggen van waterwinningen met zeer grote diameter en in zeer grof materiaal, zoals dit het geval is in bv. de maasgrinden. Hierbij wordt een grote casing door middel van een oscillatiebeweging (schudkader) in de grond gedreven die vervolgens, zoals bij het pulsen, aan de binnenkant wordt leeggemaakt d.m.v. een grijper aan een kabelkraan. Als de casing tot in de watervoerende laag gedreven is en leeggemaakt, wordt in het midden ervan de putuitrusting geplaatst, die met het nodige grindpakket wordt omgeven, terwijl stelselmatig de casing wordt teruggetrokken.
in scheme: Conceptschema boormethodes
notation: grijperboring
note: Boringen en exploitatie van grondwaterwinningsputten. Deel 1 Overzicht van de meest gebruikte boortechnieken (https://navigator.emis.vito.be/light?woId=76828&woLang=nl&woVersion=2024-04-07).
note: Dit is een methode die meestal wordt aangewend voor het aanleggen van waterwinningen met zeer grote diameter en in zeer grof materiaal, zoals dit het geval is in bv. de maasgrinden. Hierbij wordt een grote casing door middel van een oscillatiebeweging (schudkader) in de grond gedreven die vervolgens, zoals bij het pulsen, aan de binnenkant wordt leeggemaakt d.m.v. een grijper aan een kabelkraan. Als de casing tot in de watervoerende laag gedreven is en leeggemaakt, wordt in het midden ervan de putuitrusting geplaatst, die met het nodige grindpakket wordt omgeven, terwijl stelselmatig de casing wordt teruggetrokken.
semantic relation: machinale boring
top concept of: Conceptschema boormethodes

grindboring
type: Concept
broader: handboring
broader transitive: handboring
definition: Handboring uitgevoerd met een grindboor voor staalname van harde en/of puinrijke gronden.
in scheme: Conceptschema boormethodes
notation: grindboring
note: Beschrijving in CMA/1/A.1 - Type Boringen en uitvoeringsmethodes gehanteerd bij staalname (https://reflabos.vito.be/2018/CMA_1_A.1.pdf).
note: Handboring uitgevoerd met een grindboor voor staalname van harde en/of puinrijke gronden.
semantic relation: handboring
top concept of: Conceptschema boormethodes

gutsboring
type: Concept
broader: handboring
broader transitive: handboring
definition: Handboring uitgevoerd door de guts zo verticaal mogelijk in de grond te drukken of hameren voor minimaal geroerde staalname.
in scheme: Conceptschema boormethodes
notation: gutsboring
note: Beschrijving in CMA/1/A.1 - Type Boringen en uitvoeringsmethodes gehanteerd bij staalname (https://reflabos.vito.be/2018/CMA_1_A.1.pdf).
note: Handboring uitgevoerd door de guts zo verticaal mogelijk in de grond te drukken of hameren voor minimaal geroerde staalname.
semantic relation: handboring
top concept of: Conceptschema boormethodes

hamerboring
type: Concept
alternative label: luchthamer, steenboring
broader: machinale boring
broader transitive: machinale boring
definition: Boring uitgevoerd met een machinaal aangedreven steenboor, hamer of luchthamer door harde ondergrond.
in scheme: Conceptschema boormethodes
notation: hamerboring
note: Boring uitgevoerd met een machinaal aangedreven steenboor, hamer of luchthamer door harde ondergrond.
note: Boringen en exploitatie van grondwaterwinningsputten. Deel 1 Overzicht van de meest gebruikte boortechnieken (https://navigator.emis.vito.be/light?woId=76828&woLang=nl&woVersion=2024-04-07).
semantic relation: machinale boring
top concept of: Conceptschema boormethodes

handboring
type: Concept
definition: Boormethode waarbij een apparaat met de hand wordt bediend en door draaien of drukken dieper de grond in wordt gedreven.
in scheme: Conceptschema boormethodes
narrower: edelmanboring
narrower: grindboring
narrower: gutsboring
narrower: handlepelboring
narrower: handpulsboring
narrower: handsteekboring
narrower: riversideboring
narrower: spiraalboring
narrower: veenboring
narrower: vrijwitboring
narrower: zuigerboring
narrower transitive: edelmanboring
narrower transitive: grindboring
narrower transitive: gutsboring
narrower transitive: handlepelboring
narrower transitive: handpulsboring
narrower transitive: handsteekboring
narrower transitive: riversideboring
narrower transitive: spiraalboring
narrower transitive: veenboring
narrower transitive: vrijwitboring
narrower transitive: zuigerboring
notation: handboring
note: Boormethode waarbij een apparaat met de hand wordt bediend en door draaien of drukken dieper de grond in wordt gedreven.
note: Definitie overgenomen van Basis Registratie Ondergrond (https://docs.geostandaarden.nl/bro/def-im-bhr-g-20230607/#detail_class_Model_Boortechniek).
semantic relation: edelmanboring
semantic relation: grindboring
semantic relation: gutsboring
semantic relation: handlepelboring
semantic relation: handpulsboring
semantic relation: handsteekboring
semantic relation: riversideboring
semantic relation: spiraalboring
semantic relation: veenboring
semantic relation: vrijwitboring
semantic relation: zuigerboring
top concept of: Conceptschema boormethodes

handlepelboring
type: Concept
broader: handboring
broader transitive: handboring
definition: Handboring uitgevoerd met een lepelboor voor (semi) geroerde staalname.
in scheme: Conceptschema boormethodes
notation: handlepelboring
note: Definitie overgenomen van Basis Registratie Ondergrond (https://docs.geostandaarden.nl/bro/def-im-bhr-g-20230607/#detail_class_Model_Boortechniek).
note: Handboring uitgevoerd met een lepelboor voor (semi) geroerde staalname.
semantic relation: handboring
top concept of: Conceptschema boormethodes

handpulsboring
type: Concept
broader: handboring
broader transitive: handboring
definition: Handboring uitgevoerd met een pulsboor voor geroerde staalname om niet-gedetailleerde boorbeschrijvingen uit te voeren.
in scheme: Conceptschema boormethodes
notation: handpulsboring
note: Beschrijving in CMA/1/A.1 - Type Boringen en uitvoeringsmethodes gehanteerd bij staalname (https://reflabos.vito.be/2018/CMA_1_A.1.pdf).
note: Handboring uitgevoerd met een pulsboor voor geroerde staalname om niet-gedetailleerde boorbeschrijvingen uit te voeren.
semantic relation: handboring
top concept of: Conceptschema boormethodes

handsteekboring
type: Concept
broader: handboring
broader transitive: handboring
definition: Handboring uitgevoerd met een steekboor voorzien van een staalnamebuis (liner) die in de grond wordt geduwd voor (semi) ongeroerde staalname.
in scheme: Conceptschema boormethodes
notation: handsteekboring
note: Beschrijving in CMA/1/A.1 - Type Boringen en uitvoeringsmethodes gehanteerd bij staalname (https://reflabos.vito.be/2018/CMA_1_A.1.pdf).
note: Handboring uitgevoerd met een steekboor voorzien van een staalnamebuis (liner) die in de grond wordt geduwd voor (semi) ongeroerde staalname.
semantic relation: handboring
top concept of: Conceptschema boormethodes

kernboring
type: Concept
alternative label: rotary kernboring, kroonboring
broader: machinale boring
broader transitive: machinale boring
definition: Boring uitgevoerd met een kernboor, (rotary kernboor, kroonboor) of steenboor waarbij boorkernen als stalen van de ondergrond bekomen worden.
in scheme: Conceptschema boormethodes
notation: kernboring
note: Beschrijving in CMA/1/A.1 - Type Boringen en uitvoeringsmethodes gehanteerd bij staalname (https://reflabos.vito.be/2018/CMA_1_A.1.pdf).
note: Boring uitgevoerd met een kernboor, (rotary kernboor, kroonboor) of steenboor waarbij boorkernen als stalen van de ondergrond bekomen worden.
semantic relation: machinale boring
top concept of: Conceptschema boormethodes

lansen
type: Concept
alternative label: spuitlans, waterslang
broader: spoelboring
broader transitive: spoelboring
definition: Lansen is een machinale boortechniek waarbij door water onder hogedruk in de grond te spuiten de grond wordt losgemaakt. Gelijktijdig wordt vaak een buis in het losse materiaal van het boorgat geduwd om het boorgat open te houden.
in scheme: Conceptschema boormethodes
notation: lans
note: Lansen is een machinale boortechniek waarbij door water onder hogedruk in de grond te spuiten de grond wordt losgemaakt. Gelijktijdig wordt vaak een buis in het losse materiaal van het boorgat geduwd om het boorgat open te houden.
semantic relation: spoelboring
top concept of: Conceptschema boormethodes

lepelboring
type: Concept
broader: drogeboring
broader transitive: drogeboring
broader transitive: machinale boring
definition: Boring uitgevoerd met een lepelboor die machinaal in de grond wordt gedreven.
in scheme: Conceptschema boormethodes
notation: lepelboring
note: Boring uitgevoerd met een lepelboor die machinaal in de grond wordt gedreven.
semantic relation: drogeboring
semantic relation: machinale boring
top concept of: Conceptschema boormethodes

luchthevelboring
type: Concept
alternative label: air-lift boring
broader: spoelboring
broader transitive: spoelboring
definition: Bij de luchthevelboring gebeurt het opwaarts transport van de boorspecie doorheen de concentrische annulaire ruimte van de dubbelwandige boorstangen. De opwaartse stroming wordt in stand gebracht door lucht via een compressor te injecteren net boven de beitel.
in scheme: Conceptschema boormethodes
notation: luchthevel
note: Beschrijving: Boren voor de installatie van verticale bodemwarmtewisselaars (versie 3.1) - Smart Geotherm: (https://www.smartgeotherm.be/documents/2014/01/boren-voor-de-installatie-van-verticale-bodemwarmtewisselaars-bij-ondiepe-geothermie.pdf/). Boringen en exploitatie van grondwaterwinningsputten. Deel 1 Overzicht van de meest gebruikte boortechnieken (https://navigator.emis.vito.be/light?woId=76828&woLang=nl&woVersion=2024-04-07).
note: Bij de luchthevelboring gebeurt het opwaarts transport van de boorspecie doorheen de concentrische annulaire ruimte van de dubbelwandige boorstangen. De opwaartse stroming wordt in stand gebracht door lucht via een compressor te injecteren net boven de beitel.
semantic relation: spoelboring
top concept of: Conceptschema boormethodes

machinale boring
type: Concept
definition: Machinaal uitgevoerde boring.
in scheme: Conceptschema boormethodes
narrower: diagrafieboring
narrower: drogeboring
narrower: grijperboring
narrower: hamerboring
narrower: kernboring
narrower: pulsboring
narrower transitive: avegaarboring
narrower transitive: diagrafieboring
narrower transitive: drogeboring
narrower transitive: gestoken boring
narrower transitive: grijperboring
narrower transitive: hamerboring
narrower transitive: kernboring
narrower transitive: lepelboring
narrower transitive: pulsboring
narrower transitive: ramguts
narrower transitive: ramkernboring
narrower transitive: slagboring
narrower transitive: roto-sonische boring
narrower transitive: trilboring
notation: machinaleboring
note: Machinaal uitgevoerde boring.
semantic relation: avegaarboring
semantic relation: diagrafieboring
semantic relation: drogeboring
semantic relation: gestoken boring
semantic relation: grijperboring
semantic relation: hamerboring
semantic relation: kernboring
semantic relation: lepelboring
semantic relation: pulsboring
semantic relation: ramguts
semantic relation: ramkernboring
semantic relation: slagboring
semantic relation: roto-sonische boring
semantic relation: trilboring
top concept of: Conceptschema boormethodes

meerdere technieken
type: Concept
definition: Boring waarbij verschillende boormethoden gecombineerd werden tijdens de uitvoering,
in scheme: Conceptschema boormethodes
notation: meerderetechnieken
note: Boring waarbij verschillende boormethoden gecombineerd werden tijdens de uitvoering,
top concept of: Conceptschema boormethodes

omgekeerde spoelboring
type: Concept
alternative label: zuigboring
broader: spoelboring
broader transitive: spoelboring
definition: Bij een omgekeerde spoelboring verloopt de wateraanvoer via de annulaire ruimte en komt de vrijgekomen grond omhoog door de boorstangen.
in scheme: Conceptschema boormethodes
notation: omgekeerdespoelboring
note: Beschrijving: Boren voor de installatie van verticale bodemwarmtewisselaars (versie 3.1) - Smart Geotherm: (https://www.smartgeotherm.be/documents/2014/01/boren-voor-de-installatie-van-verticale-bodemwarmtewisselaars-bij-ondiepe-geothermie.pdf/). Boringen en exploitatie van grondwaterwinningsputten. Deel 1 Overzicht van de meest gebruikte boortechnieken (https://navigator.emis.vito.be/light?woId=76828&woLang=nl&woVersion=2024-04-07).
note: Bij een omgekeerde spoelboring verloopt de wateraanvoer via de annulaire ruimte en komt de vrijgekomen grond omhoog door de boorstangen.
semantic relation: spoelboring
top concept of: Conceptschema boormethodes

onbekend
type: Concept
definition: Het is niet gekend hoe het object bemonsterd werd. Deze optie wordt vooral gebruikt bij het ingeven van (oude) archiefdata waar de boormethode niet gedocumenteerd werd.
in scheme: Conceptschema boormethodes
notation: onbekend
note: Het is niet gekend hoe het object bemonsterd werd. Deze optie wordt vooral gebruikt bij het ingeven van (oude) archiefdata waar de boormethode niet gedocumenteerd werd.
top concept of: Conceptschema boormethodes

pulsboring
type: Concept
alternative label: pulsinstallatie, counterflushboring
broader: machinale boring
broader transitive: machinale boring
definition: Boring uitgevoerd met een machinaal aangedreven pulsboor.
in scheme: Conceptschema boormethodes
notation: pulsboring
note: Beschrijving: Boren voor de installatie van verticale bodemwarmtewisselaars (versie 3.1) - Smart Geotherm: (https://www.smartgeotherm.be/documents/2014/01/boren-voor-de-installatie-van-verticale-bodemwarmtewisselaars-bij-ondiepe-geothermie.pdf/).
note: Boring uitgevoerd met een machinaal aangedreven pulsboor.
semantic relation: machinale boring
top concept of: Conceptschema boormethodes

ramguts
type: Concept
broader: slagboring
broader transitive: drogeboring
broader transitive: machinale boring
broader transitive: slagboring
definition: Boring uitgevoerd met een gutsboor die machinaal met een slaghamer in de grond wordt gedreven.
in scheme: Conceptschema boormethodes
notation: ramguts
note: Beschrijving in CMA/1/A.1 - Type Boringen en uitvoeringsmethodes gehanteerd bij staalname (https://reflabos.vito.be/2018/CMA_1_A.1.pdf).
note: Boring uitgevoerd met een gutsboor die machinaal met een slaghamer in de grond wordt gedreven.
semantic relation: drogeboring
semantic relation: machinale boring
semantic relation: slagboring
top concept of: Conceptschema boormethodes

ramkernboring
type: Concept
alternative label: holle avegaarboring
broader: slagboring
broader transitive: drogeboring
broader transitive: machinale boring
broader transitive: slagboring
definition: Boring uitgevoerd met een machinaal aangedreven spiraalboor (schroef) rond een holle binnenbuis om op de bereikte diepte een monster te nemen m.b.v. een ramguts, steekbus, staalnamebuis, of een peilbuis te plaatsen. Een valgewicht hamert een binnenbuis, voorzien van een staalnamebuis tot op diepte.
in scheme: Conceptschema boormethodes
notation: ramkernboring
note: Boring uitgevoerd met een machinaal aangedreven spiraalboor (schroef) rond een holle binnenbuis om op de bereikte diepte een monster te nemen m.b.v. een ramguts, steekbus, staalnamebuis, of een peilbuis te plaatsen. Een valgewicht hamert een binnenbuis, voorzien van een staalnamebuis tot op diepte.
note: Bron: Afdeling Geotechniek (VO). Beschrijving in CMA/1/A.1 - Type Boringen en uitvoeringsmethodes gehanteerd bij staalname (https://reflabos.vito.be/2018/CMA_1_A.1.pdf).
semantic relation: drogeboring
semantic relation: machinale boring
semantic relation: slagboring
top concept of: Conceptschema boormethodes

riversideboring
type: Concept
broader: handboring
broader transitive: handboring
definition: Handboring uitgevoerd met een riversideboor voor geroerde staalname.
in scheme: Conceptschema boormethodes
notation: riversideboring
note: Beschrijving in CMA/1/A.1 - Type Boringen en uitvoeringsmethodes gehanteerd bij staalname (https://reflabos.vito.be/2018/CMA_1_A.1.pdf).
note: Handboring uitgevoerd met een riversideboor voor geroerde staalname.
semantic relation: handboring
top concept of: Conceptschema boormethodes

rollerbit
type: Concept
alternative label: spoelboring met rollerbit, spoelboring met rollenbeitel
broader: spoelboring
broader transitive: spoelboring
definition: Boring uitgevoerd met een mechanisch aangedreven rollenbeitel door harde ondergrond,
in scheme: Conceptschema boormethodes
notation: rollerbit
note: Beschrijving Techniek Verticale boringen (https://smetgroup.be/wp-content/uploads/techniek_verticale_boringen.pdf).
note: Boring uitgevoerd met een mechanisch aangedreven rollenbeitel door harde ondergrond,
semantic relation: spoelboring
top concept of: Conceptschema boormethodes

slagboring
type: Concept
broader: drogeboring
broader transitive: drogeboring
broader transitive: machinale boring
definition: Boring waarbij middels slagen op de boorstang, deze in de ondergrond ingebracht wordt.
in scheme: Conceptschema boormethodes
narrower: gestoken boring
narrower: ramguts
narrower: ramkernboring
narrower transitive: gestoken boring
narrower transitive: ramguts
narrower transitive: ramkernboring
notation: slagboring
note: Beschrijving: Boren voor de installatie van verticale bodemwarmtewisselaars (versie 3.1) - Smart Geotherm: (https://www.smartgeotherm.be/documents/2014/01/boren-voor-de-installatie-van-verticale-bodemwarmtewisselaars-bij-ondiepe-geothermie.pdf).
note: Boring waarbij middels slagen op de boorstang, deze in de ondergrond ingebracht wordt.
semantic relation: drogeboring
semantic relation: gestoken boring
semantic relation: machinale boring
semantic relation: ramguts
semantic relation: ramkernboring
top concept of: Conceptschema boormethodes

roto-sonische boring
type: Concept
alternative label: sonische boring
broader: trilboring
broader transitive: drogeboring
broader transitive: machinale boring
broader transitive: trilboring
definition: De (roto) sonische boring is een trilboring waarbij de boorstang onder hoogfrequente trilling al dan niet roterend in de grond wordt gebracht.
in scheme: Conceptschema boormethodes
notation: sonischeboring
note: Beschrijving in CMA/1/A.1 - Type Boringen en uitvoeringsmethodes gehanteerd bij staalname (https://reflabos.vito.be/2018/CMA_1_A.1.pdf). Beschrijving: Boren voor de installatie van verticale bodemwarmtewisselaars (versie 3.1) - Smart Geotherm: (https://www.smartgeotherm.be/documents/2014/01/boren-voor-de-installatie-van-verticale-bodemwarmtewisselaars-bij-ondiepe-geothermie.pdf).
note: De (roto) sonische boring is een trilboring waarbij de boorstang onder hoogfrequente trilling al dan niet roterend in de grond wordt gebracht.
semantic relation: drogeboring
semantic relation: machinale boring
semantic relation: trilboring
top concept of: Conceptschema boormethodes

spade
type: Concept
broader: geen boring
broader transitive: geen boring
definition: Deze boormethode wordt gebruikt om objecten te beschrijven die bemonsterd werden d.m.v. een spade.
in scheme: Conceptschema boormethodes
notation: spade
note: Deze boormethode wordt gebruikt om objecten te beschrijven die bemonsterd werden d.m.v. een spade.
semantic relation: geen boring
top concept of: Conceptschema boormethodes

spiraalboring
type: Concept
alternative label: handavegaarboring
broader: handboring
broader transitive: handboring
definition: Handboring uitgevoerd met een schroef voor geroerde staalname.
in scheme: Conceptschema boormethodes
notation: spiraalboring
note: Beschrijving in CMA/1/A.1 - Type Boringen en uitvoeringsmethodes gehanteerd bij staalname (https://reflabos.vito.be/2018/CMA_1_A.1.pdf).
note: Handboring uitgevoerd met een schroef voor geroerde staalname.
semantic relation: handboring
top concept of: Conceptschema boormethodes

spoelboring
type: Concept
definition: De spoelboring is, behalve de eerste meters, een onverbuisde boortechniek waarbij met een roterende getande boorbeitel die bevestigd is aan een holle boorbuis, de grond wordt losgemaakt. Het losgeboorde materiaal wordt door middel van een vloeistof naar boven getransporteerd. Deze vloeistof of spoeling dient niet alleen om het losgeboorde materiaal te verwijderen, maar ook om de boorgatwand stabiel te houden. Men maakt een onderscheid tussen verschillende spoelboringen afhankelijk van de manier waarop de spoeling circuleert.
in scheme: Conceptschema boormethodes
narrower: directe spoelboring
narrower: lansen
narrower: luchthevelboring
narrower: omgekeerde spoelboring
narrower: rollerbit
narrower transitive: directe spoelboring
narrower transitive: lansen
narrower transitive: luchthevelboring
narrower transitive: omgekeerde spoelboring
narrower transitive: rollerbit
notation: spoelboring
note: Beschrijving: Boren voor de installatie van verticale bodemwarmtewisselaars (versie 3.1) - Smart Geotherm: (https://www.smartgeotherm.be/documents/2014/01/boren-voor-de-installatie-van-verticale-bodemwarmtewisselaars-bij-ondiepe-geothermie.pdf/). Boringen en exploitatie van grondwaterwinningsputten. Deel 1 Overzicht van de meest gebruikte boortechnieken (https://navigator.emis.vito.be/light?woId=76828&woLang=nl&woVersion=2024-04-07).
note: De spoelboring is, behalve de eerste meters, een onverbuisde boortechniek waarbij met een roterende getande boorbeitel die bevestigd is aan een holle boorbuis, de grond wordt losgemaakt. Het losgeboorde materiaal wordt door middel van een vloeistof naar boven getransporteerd. Deze vloeistof of spoeling dient niet alleen om het losgeboorde materiaal te verwijderen, maar ook om de boorgatwand stabiel te houden. Men maakt een onderscheid tussen verschillende spoelboringen afhankelijk van de manier waarop de spoeling circuleert.
semantic relation: directe spoelboring
semantic relation: lansen
semantic relation: luchthevelboring
semantic relation: omgekeerde spoelboring
semantic relation: rollerbit
top concept of: Conceptschema boormethodes

trilboring
type: Concept
broader: drogeboring
broader transitive: drogeboring
broader transitive: machinale boring
definition: Boring waarbij de boorstang machinaal in de grond wordt getrild.
in scheme: Conceptschema boormethodes
narrower: roto-sonische boring
narrower transitive: roto-sonische boring
notation: trilboring
note: Beschrijving in CMA/1/A.1 - Type Boringen en uitvoeringsmethodes gehanteerd bij staalname (https://reflabos.vito.be/2018/CMA_1_A.1.pdf).
note: Boring waarbij de boorstang machinaal in de grond wordt getrild.
semantic relation: drogeboring
semantic relation: machinale boring
semantic relation: roto-sonische boring
top concept of: Conceptschema boormethodes

veenboring
type: Concept
broader: handboring
broader transitive: handboring
definition: Handboring uitgevoerd met een veenboor voor (semi) geroerde staalname.
in scheme: Conceptschema boormethodes
notation: veenboring
note: Beschrijving in CMA/1/A.4 - Apparatuur en materiaal (https://reflabos.vito.be/2024/CMA_1_A.4.pdf).
note: Handboring uitgevoerd met een veenboor voor (semi) geroerde staalname.
semantic relation: handboring
top concept of: Conceptschema boormethodes

vrijwitboring
type: Concept
broader: handboring
broader transitive: handboring
definition: Handboring uitgevoerd met een vrijwitboor voor ongeroerde staalname om de gelaagdheid en samenstelling van een bodem te beschrijven.
in scheme: Conceptschema boormethodes
notation: vrijwitboring
note: Beschrijving in CMA/1/A.4 - Apparatuur en materiaal (https://reflabos.vito.be/2024/CMA_1_A.4.pdf).
note: Handboring uitgevoerd met een vrijwitboor voor ongeroerde staalname om de gelaagdheid en samenstelling van een bodem te beschrijven.
semantic relation: handboring
top concept of: Conceptschema boormethodes

zuigerboring
type: Concept
alternative label: vanderstaayboring
broader: handboring
broader transitive: handboring
definition: Handboring uitgevoerd met een zuigerboor voorzien van een roestvrij stalen steekbuis voor ongeroerde staalname.
in scheme: Conceptschema boormethodes
notation: zuigerboring
note: Beschrijving in CMA/1/A.1 - Type Boringen en uitvoeringsmethodes gehanteerd bij staalname (https://reflabos.vito.be/2018/CMA_1_A.1.pdf). Beschrijving in CMA/1/A.4 - Apparatuur en materiaal (https://reflabos.vito.be/2024/CMA_1_A.4.pdf).
note: Handboring uitgevoerd met een zuigerboor voorzien van een roestvrij stalen steekbuis voor ongeroerde staalname.
semantic relation: handboring
top concept of: Conceptschema boormethodes

Conceptschema boormethodes
type: ConceptScheme
definition: Beschrijving welke procedure werd gevolgd bij de bemonstering.
has top concept: avegaarboring
has top concept: diagrafieboring
has top concept: directe spoelboring
has top concept: drogeboring
has top concept: edelmanboring
has top concept: geen boring
has top concept: gestoken boring
has top concept: graafmachine
has top concept: grijperboring
has top concept: grindboring
has top concept: gutsboring
has top concept: hamerboring
has top concept: handboring
has top concept: handlepelboring
has top concept: handpulsboring
has top concept: handsteekboring
has top concept: kernboring
has top concept: lansen
has top concept: lepelboring
has top concept: luchthevelboring
has top concept: machinale boring
has top concept: meerdere technieken
has top concept: omgekeerde spoelboring
has top concept: onbekend
has top concept: pulsboring
has top concept: ramguts
has top concept: ramkernboring
has top concept: riversideboring
has top concept: rollerbit
has top concept: slagboring
has top concept: roto-sonische boring
has top concept: spade
has top concept: spiraalboring
has top concept: spoelboring
has top concept: trilboring
has top concept: veenboring
has top concept: vrijwitboring
has top concept: zuigerboring
notation: boormethodes
note: Beschrijving welke procedure werd gevolgd bij de bemonstering.